BDBM340908 US9765054, Compound 52
SMILES ONC(=O)[C@@H]1[C@@H]([C@H]1c1ccc(cc1)-c1ccc2CN(Cc2c1)C1CC1)c1ccccc1
InChI Key InChIKey=JREWFEAQMZQTEQ-TWJOJJKGSA-N
Data  1 IC50
  Tab Delimited (TSV)   2D SDfile   Computed 3D by Vconf -m prep SDfile
Find this compound or compounds like it in BindingDB:
Activity Spreadsheet -- Enzyme Inhibition Constant Data from BindingDB
Found 1 hit for monomerid = 340908
TargetHistone deacetylase 4(Homo sapiens (Human))
Chdi Foundation
US Patent
LigandPNGBDBM340908(US9765054, Compound 52)
Affinity DataIC50:  480nM. Assay description: 5 μl of each solution of 1:20 diluted compound from above is transferred to a clear bottomed, black, 384-well assay plate using the Bravo or the...
Ligand InfoPC cidPC sid
In DepthDetails US Patent